Reaction Details
TargetAurora kinase A
LigandBDBM50443504
Substrate/Competitorn/a
Meas. Tech.ChEMBL_1275024 (CHEMBL3090782)
IC50 75±n/a nM
Citation Bavetsias, VFaisal, ACrumpler, SBrown, NKosmopoulou, MJoshi, AAtrash, BPérez-Fuertes, YSchmitt, JABoxall, KJBurke, RSun, CAvery, SBush, KHenley, ARaynaud, FIWorkman, PBayliss, RLinardopoulos, SBlagg, J Aurora isoform selectivity: design and synthesis of imidazo[4,5-b]pyridine derivatives as highly selective inhibitors of Aurora-A kinase in cells. J Med Chem56:9122-35 (2013) 
 
Aurora kinase A
Name:Aurora kinase A
Type:Serine/threonine-protein kinase
Mol. Mass.:45830.98
Organism:Homo sapiens (Human)
Description:O14965
Residue:403
BDBM50443504
NameBDBM50443504
Synonyms:CHEMBL3087783
TypeSmall organic molecule
Emp. Form.C24H20ClN7O
Mol. Mass.457.915
SMILESCc1nn(C)cc1-c1nc2ncc(Cl)c(Nc3ccc(cc3)C(=O)Nc3ccccc3)c2[nH]1