Reaction Details
TargetTyrosine-protein phosphatase non-receptor type 1
LigandBDBM50349826
Substrate/Competitorn/a
Meas. Tech.ChEMBL_1275583 (CHEMBL3090684)
IC50 15010±n/a nM
Citation Nguyen, PHYang, JLUddin, MNPark, SLLim, SIJung, DWWilliams, DROh, WK Protein tyrosine phosphatase 1B (PTP1B) inhibitors from Morinda citrifolia (Noni) and their insulin mimetic activity. J Nat Prod76:2080-7 (2013) 
 
Tyrosine-protein phosphatase non-receptor type 1
Name:Tyrosine-protein phosphatase non-receptor type 1
Type:Protein phosphatase
Mol. Mass.:49963.76
Organism:Homo sapiens (Human)
Description:Human recombinant GST-fusion PTP1B (1-435).
Residue:435
BDBM50349826
NameBDBM50349826
Synonyms:SYRINGARESINOL
TypeSmall organic molecule
Emp. Form.C22H26O8
Mol. Mass.418.437
SMILESCOc1cc(cc(OC)c1O)[C@H]1OC[C@H]2[C@@H]1CO[C@@H]2c1cc(OC)c(O)c(OC)c1