Reaction Details
TargetC-X-C chemokine receptor type 4
LigandBDBM50443547
Substrate/Competitorn/a
Meas. Tech.ChEMBL_1278926 (CHEMBL3097226)
IC50 8.0±n/a nM
Citation Truax, VMZhao, HKatzman, BMProsser, ARAlcaraz, AASaindane, MTHoward, RBCulver, DArrendale, RFGruddanti, PREvers, TJNatchus, MGSnyder, JPLiotta, DCWilson, LJ Discovery of tetrahydroisoquinoline-based CXCR4 antagonists. ACS Med Chem Lett4:1025-30 (2013) 
 
C-X-C chemokine receptor type 4
Name:C-X-C chemokine receptor type 4
Type:Enzyme
Mol. Mass.:39754.61
Organism:Homo sapiens (Human)
Description:P61073
Residue:352
BDBM50443547
NameBDBM50443547
Synonyms:CHEMBL3091681
TypeSmall organic molecule
Emp. Form.C25H36N4
Mol. Mass.392.5801
SMILESCN(C)CCCCN(C[C@H]1Cc2ccccc2CN1)[C@H]1CCCc2cccnc12