Reaction Details
TargetC-X-C chemokine receptor type 4
LigandBDBM50443559
Substrate/Competitorn/a
Meas. Tech.ChEMBL_1278928 (CHEMBL3097228)
IC50>30000±n/a nM
Citation Truax, VMZhao, HKatzman, BMProsser, ARAlcaraz, AASaindane, MTHoward, RBCulver, DArrendale, RFGruddanti, PREvers, TJNatchus, MGSnyder, JPLiotta, DCWilson, LJ Discovery of tetrahydroisoquinoline-based CXCR4 antagonists. ACS Med Chem Lett4:1025-30 (2013) 
 
C-X-C chemokine receptor type 4
Name:C-X-C chemokine receptor type 4
Type:Enzyme
Mol. Mass.:39754.61
Organism:Homo sapiens (Human)
Description:P61073
Residue:352
BDBM50443559
NameBDBM50443559
Synonyms:CHEMBL3091680
TypeSmall organic molecule
Emp. Form.C23H32N4
Mol. Mass.364.527
SMILESNCCCCN(C[C@H]1CCc2ccccc2N1)[C@H]1CCCc2cccnc12