Reaction Details
TargetHepatocyte growth factor receptor
LigandBDBM50443560
Substrate/Competitorn/a
Meas. Tech.ChEMBL_1279146 (CHEMBL3095081)
IC50 1.9±n/a nM
Citation Li, JWu, NTian, YZhang, JWu, S Aminopyridyl/Pyrazinyl Spiro[indoline-3,4'-piperidine]-2-ones As Highly Selective and Efficacious c-Met/ALK Inhibitors. ACS Med Chem Lett4:806-10 (2013) 
 
Hepatocyte growth factor receptor
Name:Hepatocyte growth factor receptor
Type:Protein
Mol. Mass.:155559.73
Organism:Homo sapiens (Human)
Description:P08581
Residue:1390
BDBM50443560
NameBDBM50443560
Synonyms:CHEMBL3091723
TypeSmall organic molecule
Emp. Form.C26H25Cl2FN4O2
Mol. Mass.515.407
SMILESC[C@@H](Oc1cc(cnc1N)-c1ccc2c(NC(=O)C22CCN(C)CC2)c1)c1c(Cl)ccc(F)c1Cl