Reaction Details
TargetProteinase-activated receptor 1
LigandBDBM50261110
Substrate/Competitorn/a
Meas. Tech.ChEMBL_1279177 (CHEMBL3095278)
IC50 120±n/a nM
Citation Lee, SSong, JHPark, CMKim, JSJeong, JHCho, WYLim, DC Discovery of Octahydroindenes as PAR1 Antagonists. ACS Med Chem Lett4:1054-8 (2013) 
 
Proteinase-activated receptor 1
Name:Proteinase-activated receptor 1
Type:Protein
Mol. Mass.:47450.07
Organism:Homo sapiens (Human)
Description:P25116
Residue:425
BDBM50261110
NameBDBM50261110
Synonyms:CHEMBL493982 VORAPAXAR
TypeSmall organic molecule
Emp. Form.C29H33FN2O4
Mol. Mass.492.5817
SMILESCCOC(=O)N[C@@H]1CC[C@@H]2[C@H](C[C@@H]3[C@@H]([C@@H](C)OC3=O)[C@H]2C=Cc2ccc(cn2)-c2cccc(F)c2)C1