Reaction Details
TargetProteinase-activated receptor 1
LigandBDBM50443585
Substrate/Competitorn/a
Meas. Tech.ChEMBL_1279179 (CHEMBL3095280)
IC50 26±n/a nM
Citation Lee, SSong, JHPark, CMKim, JSJeong, JHCho, WYLim, DC Discovery of Octahydroindenes as PAR1 Antagonists. ACS Med Chem Lett4:1054-8 (2013) 
 
Proteinase-activated receptor 1
Name:Proteinase-activated receptor 1
Type:Protein
Mol. Mass.:47450.07
Organism:Homo sapiens (Human)
Description:P25116
Residue:425
BDBM50443585
NameBDBM50443585
Synonyms:CHEMBL3091994
TypeSmall organic molecule
Emp. Form.C24H26FNO2
Mol. Mass.379.4671
SMILESFc1cccc(c1)-c1ccc(\C=C\[C@@H]2[C@H]3CCCC[C@H]3CC22OCCO2)nc1