Reaction Details
TargetNuclear receptor subfamily 1 group I member 2
LigandBDBM50443614
Substrate/Competitorn/a
Meas. Tech.ChEMBL_1279400 (CHEMBL3096556)
EC50 8400±n/a nM
Citation Shao, PPYe, FChakravarty, PKHerrington, JBDai, GBugianesi, RMHaedo, RJSwensen, AMWarren, VASmith, MMGarcia, MLMcManus, OBLyons, KALi, XGreen, MJochnowitz, NMcGowan, EMistry, SSun, SYAbbadie, CKaczorowski, GJDuffy, JL Improved Cav2.2 Channel Inhibitors through a gem-Dimethylsulfone Bioisostere Replacement of a Labile Sulfonamide. ACS Med Chem Lett4:1064-8 (2013) 
 
Nuclear receptor subfamily 1 group I member 2
Name:Nuclear receptor subfamily 1 group I member 2
Type:Nuclear receptor
Mol. Mass.:49774.77
Organism:Homo sapiens (Human)
Description:O75469
Residue:434
BDBM50443614
NameBDBM50443614
Synonyms:CHEMBL3092200
TypeSmall organic molecule
Emp. Form.C24H24F3N3O5S2
Mol. Mass.555.59
SMILESCS(=O)(=O)c1cc(ccc1C(=O)N1CCC(CC1)N(C1CC1)S(=O)(=O)c1cccc(c1)C(F)(F)F)C#N