Reaction Details
TargetSerine/threonine-protein kinase Sgk1
LigandBDBM50443628
Substrate/Competitorn/a
Meas. Tech.ChEMBL_1279842 (CHEMBL3095701)
IC50 690±n/a nM
Citation Blass, B N-[4-(1H-Pyrazolo[3,4-B]pyrazin-6yl)-phenyl]-sulonamides and Their Use As Pharmaceuticals. ACS Med Chem Lett4:1022-4 (2013) 
 
Serine/threonine-protein kinase Sgk1
Name:Serine/threonine-protein kinase Sgk1
Type:Other Protein Type
Mol. Mass.:48954.40
Organism:Homo sapiens (Human)
Description:Recombinant human SGK-1 enzyme produced in a baculovirus system.
Residue:431
BDBM50443628
NameBDBM50443628
Synonyms:CHEMBL3092468 US9221828, 35
TypeSmall organic molecule
Emp. Form.C17H12ClFN6O2S
Mol. Mass.418.833
SMILESNc1n[nH]c2nc(cnc12)-c1ccc(NS(=O)(=O)c2cc(Cl)ccc2F)cc1