Reaction Details
TargetCyclin-T1/Cyclin-dependent kinase 9
LigandBDBM50443638
Substrate/Competitorn/a
Meas. Tech.ChEMBL_1280772 (CHEMBL3097756)
IC50 3700±n/a nM
Citation Burgy, GTahtouh, TDurieu, EFoll-Josselin, BLimanton, EMeijer, LCarreaux, FBazureau, JP Chemical synthesis and biological validation of immobilized protein kinase inhibitory Leucettines. Eur J Med Chem62:728-37 (2013) 
 
Cyclin-T1/Cyclin-dependent kinase 9
Name:Cyclin-T1/Cyclin-dependent kinase 9
Type:Protein Complex
Mol. Mass.:n/a
Description:n/a
Components:This complex has 2 components.
Component 1
Name:Cyclin-T1
Synonyms:CCNT1 CycT Cyclin T Cyclin-T
Type:Enzyme Subunit
Mol. Mass.:80712.40
Organism:Homo sapiens (Human)
Description:n/a
Residue:726
Component 2
Name:Cyclin-dependent kinase 9
Synonyms:C-2K CDK9 Cell division cycle 2-like protein kinase 4 Cyclin-Dependent Kinase 9 (CDK9) Serine/threonine-protein kinase PITALRE Tat-associated kinase complex catalytic subunit
Type:Enzyme Subunit
Mol. Mass.:42789.13
Organism:Homo sapiens (Human)
Description:n/a
Residue:372
BDBM50443638
NameBDBM50443638
Synonyms:CHEMBL3092863
TypeSmall organic molecule
Emp. Form.C25H30N4O7
Mol. Mass.498.5283
SMILESNCCOCCOCCOCCOc1ccc(NC2=NC(=Cc3ccc4OCOc4c3)C(=O)N2)cc1