Reaction Details
TargetDual specificity tyrosine-phosphorylation-regulated kinase 3
LigandBDBM50443641
Substrate/Competitorn/a
Meas. Tech.ChEMBL_1280763 (CHEMBL3097747)
IC50>10000±n/a nM
Citation Burgy, GTahtouh, TDurieu, EFoll-Josselin, BLimanton, EMeijer, LCarreaux, FBazureau, JP Chemical synthesis and biological validation of immobilized protein kinase inhibitory Leucettines. Eur J Med Chem62:728-37 (2013) 
 
Dual specificity tyrosine-phosphorylation-regulated kinase 3
Name:Dual specificity tyrosine-phosphorylation-regulated kinase 3
Type:PROTEIN
Mol. Mass.:65747.26
Organism:Homo sapiens (Human)
Description:ChEMBL_1508026
Residue:588
BDBM50443641
NameBDBM50443641
Synonyms:CHEMBL3092860
TypeSmall organic molecule
Emp. Form.C16H13N3O
Mol. Mass.263.2939
SMILESO=C1NC(Nc2ccccc2)=NC1=Cc1ccccc1