Reaction Details
TargetDual specificity tyrosine-phosphorylation-regulated kinase 2
LigandBDBM50443638
Substrate/Competitorn/a
Meas. Tech.ChEMBL_1280764 (CHEMBL3097748)
IC50 130±n/a nM
Citation Burgy, GTahtouh, TDurieu, EFoll-Josselin, BLimanton, EMeijer, LCarreaux, FBazureau, JP Chemical synthesis and biological validation of immobilized protein kinase inhibitory Leucettines. Eur J Med Chem62:728-37 (2013) 
 
Dual specificity tyrosine-phosphorylation-regulated kinase 2
Name:Dual specificity tyrosine-phosphorylation-regulated kinase 2
Type:PROTEIN
Mol. Mass.:66690.69
Organism:Homo sapiens (Human)
Description:ChEMBL_1508025
Residue:601
BDBM50443638
NameBDBM50443638
Synonyms:CHEMBL3092863
TypeSmall organic molecule
Emp. Form.C25H30N4O7
Mol. Mass.498.5283
SMILESNCCOCCOCCOCCOc1ccc(NC2=NC(=Cc3ccc4OCOc4c3)C(=O)N2)cc1