Reaction Details
TargetDual specificity tyrosine-phosphorylation-regulated kinase 1B
LigandBDBM50347750
Substrate/Competitorn/a
Meas. Tech.ChEMBL_1280765 (CHEMBL3097749)
IC50 77±n/a nM
Citation Burgy, GTahtouh, TDurieu, EFoll-Josselin, BLimanton, EMeijer, LCarreaux, FBazureau, JP Chemical synthesis and biological validation of immobilized protein kinase inhibitory Leucettines. Eur J Med Chem62:728-37 (2013) 
 
Dual specificity tyrosine-phosphorylation-regulated kinase 1B
Name:Dual specificity tyrosine-phosphorylation-regulated kinase 1B
Type:Enzyme
Mol. Mass.:69222.24
Organism:Homo sapiens (Human)
Description:Q9Y463
Residue:629
BDBM50347750
NameBDBM50347750
Synonyms:CHEMBL1802358
TypeSmall organic molecule
Emp. Form.C17H13N3O3
Mol. Mass.307.3034
SMILESO=C1NC(Nc2ccccc2)=NC1=Cc1ccc2OCOc2c1