Reaction Details
TargetCell division cycle 7-related protein kinase
LigandBDBM50443643
Substrate/Competitorn/a
Meas. Tech.ChEMBL_1277971 (CHEMBL3095009)
IC50 710±n/a nM
Citation Harrington, PEBourbeau, MPFotsch, CFrohn, MPickrell, AJReichelt, ASham, KSiegmund, ACBailis, JMBush, TEscobar, SHickman, DHeller, SHsieh, FOrf, JNRong, MSan Miguel, TTan, HZalameda, LAllen, JG The optimization of aminooxadiazoles as orally active inhibitors of Cdc7. Bioorg Med Chem Lett23:6396-400 (2013) 
 
Cell division cycle 7-related protein kinase
Name:Cell division cycle 7-related protein kinase
Type:Protein
Mol. Mass.:63908.16
Organism:Homo sapiens (Human)
Description:O00311
Residue:574
BDBM50443643
NameBDBM50443643
Synonyms:CHEMBL3093055
TypeSmall organic molecule
Emp. Form.C18H14N4O
Mol. Mass.302.33
SMILESC(Nc1nnc(o1)-c1ccc2cnccc2c1)c1ccccc1