Reaction Details
TargetCell division cycle 7-related protein kinase/Protein DBF4 homolog A
LigandBDBM50443655
Substrate/Competitorn/a
Meas. Tech.ChEMBL_1277972 (CHEMBL3095010)
IC50 35±n/a nM
Citation Harrington, PEBourbeau, MPFotsch, CFrohn, MPickrell, AJReichelt, ASham, KSiegmund, ACBailis, JMBush, TEscobar, SHickman, DHeller, SHsieh, FOrf, JNRong, MSan Miguel, TTan, HZalameda, LAllen, JG The optimization of aminooxadiazoles as orally active inhibitors of Cdc7. Bioorg Med Chem Lett23:6396-400 (2013) 
 
Cell division cycle 7-related protein kinase/Protein DBF4 homolog A
Name:Cell division cycle 7-related protein kinase/Protein DBF4 homolog A
Type:Protein
Mol. Mass.:n/a
Description:n/a
Components:This complex has 2 components.
Component 1
Name:Protein DBF4 homolog A
Synonyms:ASK Chiffon homolog A DBF4-type zinc finger-containing protein 1 DBF4A_HUMAN ZDBF1
Type:Regulatory subunit
Mol. Mass.:76869.65
Organism:Homo sapiens (Human)
Description:n/a
Residue:674
Component 2
Name:Cell division cycle 7-related protein kinase
Synonyms:CDC7 CDC7L1 Cell division cycle 7-related protein kinase (CDC7) huCdc7
Type:Protein
Mol. Mass.:63908.16
Organism:Homo sapiens (Human)
Description:O00311
Residue:574
BDBM50443655
NameBDBM50443655
Synonyms:CHEMBL3093069
TypeSmall organic molecule
Emp. Form.C17H15N5O
Mol. Mass.305.3339
SMILESC[C@H](Nc1nnc(o1)-c1c[nH]c2ncccc12)c1ccccc1