Reaction Details
TargetCell division cycle 7-related protein kinase
LigandBDBM50443645
Substrate/Competitorn/a
Meas. Tech.ChEMBL_1277971 (CHEMBL3095009)
IC50 250±n/a nM
Citation Harrington, PEBourbeau, MPFotsch, CFrohn, MPickrell, AJReichelt, ASham, KSiegmund, ACBailis, JMBush, TEscobar, SHickman, DHeller, SHsieh, FOrf, JNRong, MSan Miguel, TTan, HZalameda, LAllen, JG The optimization of aminooxadiazoles as orally active inhibitors of Cdc7. Bioorg Med Chem Lett23:6396-400 (2013) 
 
Cell division cycle 7-related protein kinase
Name:Cell division cycle 7-related protein kinase
Type:Protein
Mol. Mass.:63908.16
Organism:Homo sapiens (Human)
Description:O00311
Residue:574
BDBM50443645
NameBDBM50443645
Synonyms:CHEMBL3093079
TypeSmall organic molecule
Emp. Form.C18H14F2N6O
Mol. Mass.368.3402
SMILESFc1ccc2c(c[nH]c2n1)-c1nnc(N[C@H](C2CC2)c2cccnc2F)o1