Reaction Details
TargetCell division cycle 7-related protein kinase
LigandBDBM50443657
Substrate/Competitorn/a
Meas. Tech.ChEMBL_1277971 (CHEMBL3095009)
IC50 7100±n/a nM
Citation Harrington, PEBourbeau, MPFotsch, CFrohn, MPickrell, AJReichelt, ASham, KSiegmund, ACBailis, JMBush, TEscobar, SHickman, DHeller, SHsieh, FOrf, JNRong, MSan Miguel, TTan, HZalameda, LAllen, JG The optimization of aminooxadiazoles as orally active inhibitors of Cdc7. Bioorg Med Chem Lett23:6396-400 (2013) 
 
Cell division cycle 7-related protein kinase
Name:Cell division cycle 7-related protein kinase
Type:Protein
Mol. Mass.:63908.16
Organism:Homo sapiens (Human)
Description:O00311
Residue:574
BDBM50443657
NameBDBM50443657
Synonyms:CHEMBL3093067
TypeSmall organic molecule
Emp. Form.C15H12N6O
Mol. Mass.292.2954
SMILESC(Nc1nnc(o1)-c1c[nH]c2ncccc12)c1cccnc1