Reaction Details
TargetCell division cycle 7-related protein kinase
LigandBDBM50443659
Substrate/Competitorn/a
Meas. Tech.ChEMBL_1277971 (CHEMBL3095009)
IC50 690±n/a nM
Citation Harrington, PEBourbeau, MPFotsch, CFrohn, MPickrell, AJReichelt, ASham, KSiegmund, ACBailis, JMBush, TEscobar, SHickman, DHeller, SHsieh, FOrf, JNRong, MSan Miguel, TTan, HZalameda, LAllen, JG The optimization of aminooxadiazoles as orally active inhibitors of Cdc7. Bioorg Med Chem Lett23:6396-400 (2013) 
 
Cell division cycle 7-related protein kinase
Name:Cell division cycle 7-related protein kinase
Type:Protein
Mol. Mass.:63908.16
Organism:Homo sapiens (Human)
Description:O00311
Residue:574
BDBM50443659
NameBDBM50443659
Synonyms:CHEMBL3093065
TypeSmall organic molecule
Emp. Form.C16H12FN5O
Mol. Mass.309.2978
SMILESFc1ccc(CNc2nnc(o2)-c2c[nH]c3ncccc23)cc1