Reaction Details
TargetCell division cycle 7-related protein kinase
LigandBDBM50443664
Substrate/Competitorn/a
Meas. Tech.ChEMBL_1277971 (CHEMBL3095009)
IC50>50000±n/a nM
Citation Harrington, PEBourbeau, MPFotsch, CFrohn, MPickrell, AJReichelt, ASham, KSiegmund, ACBailis, JMBush, TEscobar, SHickman, DHeller, SHsieh, FOrf, JNRong, MSan Miguel, TTan, HZalameda, LAllen, JG The optimization of aminooxadiazoles as orally active inhibitors of Cdc7. Bioorg Med Chem Lett23:6396-400 (2013) 
 
Cell division cycle 7-related protein kinase
Name:Cell division cycle 7-related protein kinase
Type:Protein
Mol. Mass.:63908.16
Organism:Homo sapiens (Human)
Description:O00311
Residue:574
BDBM50443664
NameBDBM50443664
Synonyms:CHEMBL3093060
TypeSmall organic molecule
Emp. Form.C16H12N4O3
Mol. Mass.308.2915
SMILESO=c1[nH]c2ccc(cc2o1)-c1nnc(NCc2ccccc2)o1