Reaction Details
Target5-hydroxytryptamine receptor 3A
LigandBDBM50443688
Substrate/Competitorn/a
Meas. Tech.ChEMBL_1278511 (CHEMBL3094818)
Ki 1200±n/a nM
Citation Fontenelle, CQWang, ZFossey, CCailly, TLinclau, BFabis, F Design of fluorinated 5-HT(4)R antagonists: influence of the basicity and lipophilicity toward the 5-HT(4)R binding affinities. Bioorg Med Chem21:7529-38 (2013) 
 
5-hydroxytryptamine receptor 3A
Name:5-hydroxytryptamine receptor 3A
Type:Protein
Mol. Mass.:55283.27
Organism:Homo sapiens (Human)
Description:P46098
Residue:478
BDBM50443688
NameBDBM50443688
Synonyms:CHEMBL3093186
TypeSmall organic molecule
Emp. Form.C21H21F4N3O
Mol. Mass.407.4046
SMILESFc1cccc2c1nc(OCC1CCN(CCC(F)(F)F)CC1)c1cccnc21