Reaction Details
Target5-hydroxytryptamine receptor 4
LigandBDBM50443691
Substrate/Competitorn/a
Meas. Tech.ChEMBL_1278685 (CHEMBL3095863)
Ki 22±n/a nM
Citation Fontenelle, CQWang, ZFossey, CCailly, TLinclau, BFabis, F Design of fluorinated 5-HT(4)R antagonists: influence of the basicity and lipophilicity toward the 5-HT(4)R binding affinities. Bioorg Med Chem21:7529-38 (2013) 
 
5-hydroxytryptamine receptor 4
Name:5-hydroxytryptamine receptor 4
Type:Enzyme Catalytic Domain
Mol. Mass.:43735.29
Organism:GUINEA PIG
Description:5-HT4 HTR4 GUINEA PIG::O70528
Residue:388
BDBM50443691
NameBDBM50443691
Synonyms:CHEMBL3093194
TypeSmall organic molecule
Emp. Form.C22H22F4N2O
Mol. Mass.406.4165
SMILESFc1cccc2c1nc(OCC1CCN(CCC(F)(F)F)CC1)c1ccccc21