Reaction Details
TargetProlyl endopeptidase FAP
LigandBDBM11118
Substrate/Competitorn/a
Meas. Tech.ChEMBL_1279907 (CHEMBL3096167)
IC50 1410±n/a nM
Citation Wang, JFeng, YJi, XDeng, GLeng, YLiu, H Synthesis and biological evaluation of pyrrolidine-2-carbonitrile and 4-fluoropyrrolidine-2-carbonitrile derivatives as dipeptidyl peptidase-4 inhibitors for the treatment of type 2 diabetes. Bioorg Med Chem21:7418-29 (2013) 
 
Prolyl endopeptidase FAP
Name:Prolyl endopeptidase FAP
Type:Enzyme
Mol. Mass.:87712.48
Organism:Homo sapiens (Human)
Description:Q12884
Residue:760
BDBM11118
NameBDBM11118
Synonyms:(2S)-1-[(2S)-2-amino-3-(4-phenylphenyl)propanoyl]pyrrolidine-2-carbonitrile | 4-substituted phenylalanine cyano-(S)-pyrrolidine deriv. 5
TypeSmall organic molecule
Emp. Form.C20H21N3O
Mol. Mass.319.4002
SMILESN[C@@H](Cc1ccc(cc1)-c1ccccc1)C(=O)N1CCC[C@H]1C#N