Reaction Details
TargetCytochrome P450 2D6
LigandBDBM50443778
Substrate/Competitorn/a
Meas. Tech.ChEMBL_1280376 (CHEMBL3095536)
IC50 13000±n/a nM
Citation Wilson, DMApps, JBailey, NBamford, MJBeresford, IJBriggs, MACalver, ARCrook, BDavis, RPDavis, SDean, DKHarris, LHeightman, TDPanchal, TParr, CAQuashie, NSteadman, JGSchogger, JSehmi, SSStean, TOTakle, AKTrail, BKWhite, TWitherington, JWorby, AMedhurst, AD The discovery of the benzazepine class of histamine H3 receptor antagonists. Bioorg Med Chem Lett23:6897-901 (2013) 
 
Cytochrome P450 2D6
Name:Cytochrome P450 2D6
Type:Protein
Mol. Mass.:55774.82
Organism:Homo sapiens (Human)
Description:P10635
Residue:497
BDBM50443778
NameBDBM50443778
Synonyms:CHEMBL3094125
TypeSmall organic molecule
Emp. Form.C20H30N2O3S
Mol. Mass.378.529
SMILESCS(=O)(=O)N1CCC(CC1)Oc1ccc2CCN(CCc2c1)C1CCC1