Reaction Details
TargetHistamine H1 receptor
LigandBDBM50443789
Substrate/Competitorn/a
Meas. Tech.ChEMBL_1280381 (CHEMBL3095541)
Ki 1259±n/a nM
Citation Wilson, DMApps, JBailey, NBamford, MJBeresford, IJBriggs, MACalver, ARCrook, BDavis, RPDavis, SDean, DKHarris, LHeightman, TDPanchal, TParr, CAQuashie, NSteadman, JGSchogger, JSehmi, SSStean, TOTakle, AKTrail, BKWhite, TWitherington, JWorby, AMedhurst, AD The discovery of the benzazepine class of histamine H3 receptor antagonists. Bioorg Med Chem Lett23:6897-901 (2013) 
 
Histamine H1 receptor
Name:Histamine H1 receptor
Type:G Protein-Coupled Receptor (GPCR)
Mol. Mass.:55808.72
Organism:Homo sapiens (Human)
Description:Cell pellets from SK-N-MC cells transfected with human H1 receptor were used in binding assay.
Residue:487
BDBM50443789
NameBDBM50443789
Synonyms:CHEMBL3094130
TypeSmall organic molecule
Emp. Form.C18H28N2O
Mol. Mass.288.4277
SMILESC(COc1ccc2CCNCCc2c1)CN1CCCCC1