Reaction Details
TargetCoagulation factor X
LigandBDBM50443853
Substrate/Competitorn/a
Meas. Tech.ChEMBL_1277819 (CHEMBL3097585)
IC50 1.000000±n/a nM
Citation Meneyrol, JFollmann, MLassalle, GWehner, VBarre, GRousseaux, TAltenburger, JMPetit, FBocskei, ZSchreuder, HAlet, NHerault, JPMillet, LDol, FFlorian, PSchaeffer, PSadoun, FKlieber, SBriot, CBono, FHerbert, JM 5-Chlorothiophene-2-carboxylic acid [(S)-2-[2-methyl-3-(2-oxopyrrolidin-1-yl)benzenesulfonylamino]-3-(4-methylpiperazin-1-yl)-3-oxopropyl]amide (SAR107375), a selective and potent orally active dual thrombin and factor Xa inhibitor. J Med Chem56:9441-56 (2014) 
 
Coagulation factor X
Name:Coagulation factor X
Type:Enzyme
Mol. Mass.:54726.60
Organism:Homo sapiens (Human)
Description:n/a
Residue:488
BDBM50443853
NameBDBM50443853
Synonyms:CHEMBL3091519 | US20230391761, Reference 1
TypeSmall organic molecule
Emp. Form.C24H30ClN5O5S2
Mol. Mass.568.109
SMILESCN1CCN(CC1)C(=O)[C@H](CNC(=O)c1ccc(Cl)s1)NS(=O)(=O)c1cccc(N2CCCC2=O)c1C