Reaction Details
TargetSonic hedgehog protein
LigandBDBM50443887
Substrate/Competitorn/a
Meas. Tech.ChEMBL_1277855 (CHEMBL3097789)
IC50 1.6±n/a nM
Citation Xin, MWen, JTang, FTu, CShen, HZhao, X The discovery of novel N-(2-pyrimidinylamino) benzamide derivatives as potent hedgehog signaling pathway inhibitors. Bioorg Med Chem Lett23:6777-83 (2013) 
 
Sonic hedgehog protein
Name:Sonic hedgehog protein
Type:Protein
Mol. Mass.:47784.50
Organism:Mus musculus (Mouse)
Description:Q62226
Residue:437
BDBM50443887
NameBDBM50443887
Synonyms:CHEMBL3091554
TypeSmall organic molecule
Emp. Form.C27H22F3N3O2
Mol. Mass.477.4777
SMILESCc1cccc(C)c1NC(=O)c1ccc(Nc2cc(ccn2)-c2ccc(OC(F)(F)F)cc2)cc1