Reaction Details
TargetSonic hedgehog protein
LigandBDBM50443891
Substrate/Competitorn/a
Meas. Tech.ChEMBL_1277855 (CHEMBL3097789)
IC50 1.4±n/a nM
Citation Xin, MWen, JTang, FTu, CShen, HZhao, X The discovery of novel N-(2-pyrimidinylamino) benzamide derivatives as potent hedgehog signaling pathway inhibitors. Bioorg Med Chem Lett23:6777-83 (2013) 
 
Sonic hedgehog protein
Name:Sonic hedgehog protein
Type:Protein
Mol. Mass.:47784.50
Organism:Mus musculus (Mouse)
Description:Q62226
Residue:437
BDBM50443891
NameBDBM50443891
Synonyms:CHEMBL3091550
TypeSmall organic molecule
Emp. Form.C27H23F3N4O2
Mol. Mass.492.4923
SMILESCc1cc(nc(Nc2ccc(cc2)C(=O)Nc2c(C)cccc2C)n1)-c1ccc(OC(F)(F)F)cc1