Reaction Details
TargetSonic hedgehog protein
LigandBDBM50443892
Substrate/Competitorn/a
Meas. Tech.ChEMBL_1277855 (CHEMBL3097789)
IC50 1.2±n/a nM
Citation Xin, MWen, JTang, FTu, CShen, HZhao, X The discovery of novel N-(2-pyrimidinylamino) benzamide derivatives as potent hedgehog signaling pathway inhibitors. Bioorg Med Chem Lett23:6777-83 (2013) 
 
Sonic hedgehog protein
Name:Sonic hedgehog protein
Type:Protein
Mol. Mass.:47784.50
Organism:Mus musculus (Mouse)
Description:Q62226
Residue:437
BDBM50443892
NameBDBM50443892
Synonyms:CHEMBL3091549
TypeSmall organic molecule
Emp. Form.C26H21F3N4O2
Mol. Mass.478.4657
SMILESCc1cccc(C)c1NC(=O)c1ccc(Nc2nccc(n2)-c2ccc(OC(F)(F)F)cc2)cc1