Reaction Details
TargetSonic hedgehog protein
LigandBDBM50443896
Substrate/Competitorn/a
Meas. Tech.ChEMBL_1277855 (CHEMBL3097789)
IC50 1.1±n/a nM
Citation Xin, MWen, JTang, FTu, CShen, HZhao, X The discovery of novel N-(2-pyrimidinylamino) benzamide derivatives as potent hedgehog signaling pathway inhibitors. Bioorg Med Chem Lett23:6777-83 (2013) 
 
Sonic hedgehog protein
Name:Sonic hedgehog protein
Type:Protein
Mol. Mass.:47784.50
Organism:Mus musculus (Mouse)
Description:Q62226
Residue:437
BDBM50443896
NameBDBM50443896
Synonyms:CHEMBL3091572
TypeSmall organic molecule
Emp. Form.C35H32F3N5O2
Mol. Mass.611.6561
SMILESCN(Cc1ccccc1)Cc1ccc(C)c(NC(=O)c2ccc(Nc3ncc(C)c(n3)-c3ccc(OC(F)(F)F)cc3)cc2)c1