Reaction Details
TargetSonic hedgehog protein
LigandBDBM50443897
Substrate/Competitorn/a
Meas. Tech.ChEMBL_1277855 (CHEMBL3097789)
IC50 2.2±n/a nM
Citation Xin, MWen, JTang, FTu, CShen, HZhao, X The discovery of novel N-(2-pyrimidinylamino) benzamide derivatives as potent hedgehog signaling pathway inhibitors. Bioorg Med Chem Lett23:6777-83 (2013) 
 
Sonic hedgehog protein
Name:Sonic hedgehog protein
Type:Protein
Mol. Mass.:47784.50
Organism:Mus musculus (Mouse)
Description:Q62226
Residue:437
BDBM50443897
NameBDBM50443897
Synonyms:CHEMBL3091571
TypeSmall organic molecule
Emp. Form.C25H25F3N4O2
Mol. Mass.470.4868
SMILESCc1cnc(Nc2ccc(cc2)C(=O)NC2CCCCC2)nc1-c1ccc(OC(F)(F)F)cc1