Reaction Details
TargetPoly [ADP-ribose] polymerase 1
LigandBDBM50444027
Substrate/Competitorn/a
Meas. Tech.ChEMBL_1278751 (CHEMBL3096298)
IC50 2500±n/a nM
Citation Lindgren, AEKarlberg, TEkblad, TSpjut, SThorsell, AGAndersson, CDNhan, TTHellsten, VWeigelt, JLinusson, ASchüler, HElofsson, M Chemical probes to study ADP-ribosylation: synthesis and biochemical evaluation of inhibitors of the human ADP-ribosyltransferase ARTD3/PARP3. J Med Chem56:9556-68 (2014) 
 
Poly [ADP-ribose] polymerase 1
Name:Poly [ADP-ribose] polymerase 1
Type:n/a
Mol. Mass.:113114.22
Organism:Homo sapiens (Human)
Description:P09874
Residue:1014
BDBM50444027
NameBDBM50444027
Synonyms:CHEMBL3092523
TypeSmall organic molecule
Emp. Form.C21H21N3O4
Mol. Mass.379.4091
SMILESCOC(=O)[C@H](Cc1ccccc1)NC(=O)CCc1nc2ccccc2c(=O)[nH]1