Reaction Details
TargetTyrosine-protein kinase receptor TYRO3
LigandBDBM50444074
Substrate/Competitorn/a
Meas. Tech.ChEMBL_1279517 (CHEMBL3097236)
IC50 21±n/a nM
Citation Zhang, WZhang, DStashko, MADeRyckere, DHunter, DKireev, DMiley, MJCummings, CLee, MNorris-Drouin, JStewart, WMSather, SZhou, YKirkpatrick, GMachius, MJanzen, WPEarp, HSGraham, DKFrye, SVWang, X Pseudo-cyclization through intramolecular hydrogen bond enables discovery of pyridine substituted pyrimidines as new Mer kinase inhibitors. J Med Chem56:9683-92 (2014) 
 
Tyrosine-protein kinase receptor TYRO3
Name:Tyrosine-protein kinase receptor TYRO3
Type:Protein
Mol. Mass.:96894.13
Organism:Homo sapiens (Human)
Description:Q06418
Residue:890
BDBM50444074
NameBDBM50444074
Synonyms:CHEMBL3092791
TypeSmall organic molecule
Emp. Form.C22H34N6O
Mol. Mass.398.545
SMILESCCCCNc1ncc(c(N[C@H]2CC[C@H](O)CC2)n1)-c1ccc(CN(C)C)cn1