Reaction Details
TargetG protein-coupled receptor kinase 5
LigandBDBM50444091
Substrate/Competitorn/a
Meas. Tech.ChEMBL_1280627 (CHEMBL3096888)
IC50 2210±n/a nM
Citation Cho, SYLee, BHJung, HYun, CSHa, JDKim, HRChae, CHLee, JHSeo, HWOh, KS Design and synthesis of novel 3-(benzo[d]oxazol-2-yl)-5-(1-(piperidin-4-yl)-1H-pyrazol-4-yl)pyridin-2-amine derivatives as selective G-protein-coupled receptor kinase-2 and -5 inhibitors. Bioorg Med Chem Lett23:6711-6 (2013) 
 
G protein-coupled receptor kinase 5
Name:G protein-coupled receptor kinase 5
Type:PROTEIN
Mol. Mass.:67798.93
Organism:Homo sapiens (Human)
Description:ChEMBL_1280627
Residue:590
BDBM50444091
NameBDBM50444091
Synonyms:CHEMBL3093257
TypeSmall organic molecule
Emp. Form.C28H26N8O2
Mol. Mass.506.5584
SMILESCOc1ccc2nc(oc2c1-c1ccc2cn[nH]c2c1)-c1cc(cnc1N)-c1cnn(c1)C1CCNCC1