Reaction Details
TargetG protein-coupled receptor kinase 5
LigandBDBM50444107
Substrate/Competitorn/a
Meas. Tech.ChEMBL_1280627 (CHEMBL3096888)
IC50 880±n/a nM
Citation Cho, SYLee, BHJung, HYun, CSHa, JDKim, HRChae, CHLee, JHSeo, HWOh, KS Design and synthesis of novel 3-(benzo[d]oxazol-2-yl)-5-(1-(piperidin-4-yl)-1H-pyrazol-4-yl)pyridin-2-amine derivatives as selective G-protein-coupled receptor kinase-2 and -5 inhibitors. Bioorg Med Chem Lett23:6711-6 (2013) 
 
G protein-coupled receptor kinase 5
Name:G protein-coupled receptor kinase 5
Type:PROTEIN
Mol. Mass.:67798.93
Organism:Homo sapiens (Human)
Description:ChEMBL_1280627
Residue:590
BDBM50444107
NameBDBM50444107
Synonyms:CHEMBL3093244
TypeSmall organic molecule
Emp. Form.C27H25FN8O2
Mol. Mass.512.5382
SMILESNc1ncc(cc1-c1nc2ccc(NC(=O)Nc3ccc(F)cc3)cc2o1)-c1cnn(c1)C1CCNCC1