Reaction Details
TargetLipoprotein lipase
LigandBDBM50444145
Substrate/Competitorn/a
Meas. Tech.ChEMBL_1280894 (CHEMBL3095192)
IC50>10000±n/a nM
Citation Sun, SDean, RJia, QZenova, AZhong, JGrayson, CXie, CLindgren, ASamra, PSojo, Lvan Heek, MLin, LPercival, DFu, JMWinther, MDZhang, Z Discovery of XEN445: a potent and selective endothelial lipase inhibitor raises plasma HDL-cholesterol concentration in mice. Bioorg Med Chem21:7724-34 (2013) 
 
Lipoprotein lipase
Name:Lipoprotein lipase
Type:PROTEIN
Mol. Mass.:53173.96
Organism:Homo sapiens (Human)
Description:ChEMBL_1280894
Residue:475
BDBM50444145
NameBDBM50444145
Synonyms:CHEMBL3093405
TypeSmall organic molecule
Emp. Form.C12H12F3NO2
Mol. Mass.259.2244
SMILESOC(=O)c1cc(ccc1NCC1CC1)C(F)(F)F