Reaction Details
TargetEndothelial lipase
LigandBDBM50444150
Substrate/Competitorn/a
Meas. Tech.ChEMBL_1280896 (CHEMBL3095194)
IC50 131±n/a nM
Citation Sun, SDean, RJia, QZenova, AZhong, JGrayson, CXie, CLindgren, ASamra, PSojo, Lvan Heek, MLin, LPercival, DFu, JMWinther, MDZhang, Z Discovery of XEN445: a potent and selective endothelial lipase inhibitor raises plasma HDL-cholesterol concentration in mice. Bioorg Med Chem21:7724-34 (2013) 
 
Endothelial lipase
Name:Endothelial lipase
Type:Protein
Mol. Mass.:56805.62
Organism:Homo sapiens (Human)
Description:Q9Y5X9
Residue:500
BDBM50444150
NameBDBM50444150
Synonyms:CHEMBL3093307
TypeSmall organic molecule
Emp. Form.C19H17F4NO3
Mol. Mass.383.3368
SMILESOC(=O)c1cc(ccc1N1CC[C@@H](C1)OCc1ccc(F)cc1)C(F)(F)F