Reaction Details
TargetEndothelial lipase
LigandBDBM50444151
Substrate/Competitorn/a
Meas. Tech.ChEMBL_1280896 (CHEMBL3095194)
IC50 236±n/a nM
Citation Sun, SDean, RJia, QZenova, AZhong, JGrayson, CXie, CLindgren, ASamra, PSojo, Lvan Heek, MLin, LPercival, DFu, JMWinther, MDZhang, Z Discovery of XEN445: a potent and selective endothelial lipase inhibitor raises plasma HDL-cholesterol concentration in mice. Bioorg Med Chem21:7724-34 (2013) 
 
Endothelial lipase
Name:Endothelial lipase
Type:Protein
Mol. Mass.:56805.62
Organism:Homo sapiens (Human)
Description:Q9Y5X9
Residue:500
BDBM50444151
NameBDBM50444151
Synonyms:CHEMBL3093306
TypeSmall organic molecule
Emp. Form.C17H14ClF3N2O3
Mol. Mass.386.753
SMILESOC(=O)c1cc(ccc1N1CC[C@@H](C1)Oc1ccc(Cl)nc1)C(F)(F)F