Reaction Details
TargetEndothelial lipase
LigandBDBM50444154
Substrate/Competitorn/a
Meas. Tech.ChEMBL_1280896 (CHEMBL3095194)
IC50 259±n/a nM
Citation Sun, SDean, RJia, QZenova, AZhong, JGrayson, CXie, CLindgren, ASamra, PSojo, Lvan Heek, MLin, LPercival, DFu, JMWinther, MDZhang, Z Discovery of XEN445: a potent and selective endothelial lipase inhibitor raises plasma HDL-cholesterol concentration in mice. Bioorg Med Chem21:7724-34 (2013) 
 
Endothelial lipase
Name:Endothelial lipase
Type:Protein
Mol. Mass.:56805.62
Organism:Homo sapiens (Human)
Description:Q9Y5X9
Residue:500
BDBM50444154
NameBDBM50444154
Synonyms:CHEMBL3093303
TypeSmall organic molecule
Emp. Form.C18H15F4NO3
Mol. Mass.369.3102
SMILESOC(=O)c1cc(ccc1N1CC[C@H](C1)Oc1ccc(F)cc1)C(F)(F)F