Reaction Details
TargetExtracellular calcium-sensing receptor
LigandBDBM50444168
Substrate/Competitorn/a
Meas. Tech.ChEMBL_1277658 (CHEMBL3096900)
EC50 20±n/a nM
Citation Wehn, PMHarrington, PECarlson, TJDavis, JDeprez, PFotsch, CHGrillo, MPLu, JYMorony, SPattabiraman, KPoon, SFReagan, JDSt Jean, DJTemal, TWang, MYang, YHenley, CLively, SE Metabolism-guided discovery of a potent and orally bioavailable urea-based calcimimetic for the treatment of secondary hyperparathyroidism. Bioorg Med Chem Lett23:6625-8 (2013) 
 
Extracellular calcium-sensing receptor
Name:Extracellular calcium-sensing receptor
Type:Protein
Mol. Mass.:120663.13
Organism:Homo sapiens (Human)
Description:P41180
Residue:1078
BDBM50444168
NameBDBM50444168
Synonyms:CHEMBL3093430
TypeSmall organic molecule
Emp. Form.C31H34F2N6O4S2
Mol. Mass.656.766
SMILESCS(=O)(=O)Nc1ccc(cc1)-c1nsc(NC(=O)N(CCC(c2ccc(F)cc2)c2ccc(F)cc2)CCN2CCOCC2)n1