Reaction Details
TargetExtracellular calcium-sensing receptor
LigandBDBM50444169
Substrate/Competitorn/a
Meas. Tech.ChEMBL_1277658 (CHEMBL3096900)
EC50 9.0±n/a nM
Citation Wehn, PMHarrington, PECarlson, TJDavis, JDeprez, PFotsch, CHGrillo, MPLu, JYMorony, SPattabiraman, KPoon, SFReagan, JDSt Jean, DJTemal, TWang, MYang, YHenley, CLively, SE Metabolism-guided discovery of a potent and orally bioavailable urea-based calcimimetic for the treatment of secondary hyperparathyroidism. Bioorg Med Chem Lett23:6625-8 (2013) 
 
Extracellular calcium-sensing receptor
Name:Extracellular calcium-sensing receptor
Type:Protein
Mol. Mass.:120663.13
Organism:Homo sapiens (Human)
Description:P41180
Residue:1078
BDBM50444169
NameBDBM50444169
Synonyms:CHEMBL3093429
TypeSmall organic molecule
Emp. Form.C30H32F2N6O4S2
Mol. Mass.642.74
SMILESNS(=O)(=O)c1ccc(cc1)-c1nsc(NC(=O)N(CCC(c2ccc(F)cc2)c2ccc(F)cc2)CCN2CCOCC2)n1