Reaction Details
TargetMineralocorticoid receptor
LigandBDBM50444194
Substrate/Competitorn/a
Meas. Tech.ChEMBL_1277675 (CHEMBL3096917)
IC50 270±n/a nM
Citation Kuzmich, DBentzien, JBetageri, RDiSalvo, DFadra-Khan, THarcken, CKukulka, ANabozny, GNelson, RPack, ESouza, DThomson, D Function-regulating pharmacophores in a sulfonamide class of glucocorticoid receptor agonists. Bioorg Med Chem Lett23:6640-4 (2013) 
 
Mineralocorticoid receptor
Name:Mineralocorticoid receptor
Type:Enzyme
Mol. Mass.:107076.42
Organism:Homo sapiens (Human)
Description:P08235
Residue:984
BDBM50444194
NameBDBM50444194
Synonyms:CHEMBL3093441
TypeSmall organic molecule
Emp. Form.C17H14Cl2F3N3O2S
Mol. Mass.452.278
SMILESNc1cc(Cl)cc(Cl)c1S(=O)(=O)NC(Cc1c[nH]c2ccccc12)C(F)(F)F