Reaction Details
TargetMineralocorticoid receptor
LigandBDBM50444207
Substrate/Competitorn/a
Meas. Tech.ChEMBL_1277675 (CHEMBL3096917)
IC50 70±n/a nM
Citation Kuzmich, DBentzien, JBetageri, RDiSalvo, DFadra-Khan, THarcken, CKukulka, ANabozny, GNelson, RPack, ESouza, DThomson, D Function-regulating pharmacophores in a sulfonamide class of glucocorticoid receptor agonists. Bioorg Med Chem Lett23:6640-4 (2013) 
 
Mineralocorticoid receptor
Name:Mineralocorticoid receptor
Type:Enzyme
Mol. Mass.:107076.42
Organism:Homo sapiens (Human)
Description:P08235
Residue:984
BDBM50444207
NameBDBM50444207
Synonyms:CHEMBL3093452
TypeSmall organic molecule
Emp. Form.C21H20F3N3O2S
Mol. Mass.435.463
SMILESCc1cc(C)c(c(C)c1)S(=O)(=O)NC(Cc1c[nH]c2c(cccc12)C#N)C(F)(F)F