Reaction Details
TargetGlucocorticoid receptor
LigandBDBM50444190
Substrate/Competitorn/a
Meas. Tech.ChEMBL_1277677 (CHEMBL3096919)
IC50 37±n/a nM
Citation Kuzmich, DBentzien, JBetageri, RDiSalvo, DFadra-Khan, THarcken, CKukulka, ANabozny, GNelson, RPack, ESouza, DThomson, D Function-regulating pharmacophores in a sulfonamide class of glucocorticoid receptor agonists. Bioorg Med Chem Lett23:6640-4 (2013) 
 
Glucocorticoid receptor
Name:Glucocorticoid receptor
Type:Enzyme
Mol. Mass.:85656.87
Organism:Homo sapiens (Human)
Description:P04150
Residue:777
BDBM50444190
NameBDBM50444190
Synonyms:CHEMBL3093447
TypeSmall organic molecule
Emp. Form.C21H23F3N2O2S
Mol. Mass.424.48
SMILESCc1ccc2c(CC(NS(=O)(=O)c3c(C)cc(C)cc3C)C(F)(F)F)c[nH]c2c1