Reaction Details
TargetGlucocorticoid receptor
LigandBDBM50444195
Substrate/Competitorn/a
Meas. Tech.ChEMBL_1277677 (CHEMBL3096919)
IC50 5.0±n/a nM
Citation Kuzmich, DBentzien, JBetageri, RDiSalvo, DFadra-Khan, THarcken, CKukulka, ANabozny, GNelson, RPack, ESouza, DThomson, D Function-regulating pharmacophores in a sulfonamide class of glucocorticoid receptor agonists. Bioorg Med Chem Lett23:6640-4 (2013) 
 
Glucocorticoid receptor
Name:Glucocorticoid receptor
Type:Enzyme
Mol. Mass.:85656.87
Organism:Homo sapiens (Human)
Description:P04150
Residue:777
BDBM50444195
NameBDBM50444195
Synonyms:CHEMBL3093440
TypeSmall organic molecule
Emp. Form.C17H17Cl2N3O2S
Mol. Mass.398.307
SMILESCC(Cc1c[nH]c2ccccc12)NS(=O)(=O)c1c(N)cc(Cl)cc1Cl