Reaction Details
TargetTyrosine-protein kinase receptor UFO
LigandBDBM50444253
Substrate/Competitorn/a
Meas. Tech.ChEMBL_1277931 (CHEMBL3094775)
IC50 560±n/a nM
Citation Zhang, WMcIver, ALStashko, MADeRyckere, DBranchford, BRHunter, DKireev, DMiley, MJNorris-Drouin, JStewart, WMLee, MSather, SZhou, YDi Paola, JAMachius, MJanzen, WPEarp, HSGraham, DKFrye, SVWang, X Discovery of Mer specific tyrosine kinase inhibitors for the treatment and prevention of thrombosis. J Med Chem56:9693-700 (2014) 
 
Tyrosine-protein kinase receptor UFO
Name:Tyrosine-protein kinase receptor UFO
Type:Enzyme
Mol. Mass.:98316.97
Organism:Homo sapiens (Human)
Description:P30530
Residue:894
BDBM50444253
NameBDBM50444253
Synonyms:CHEMBL3093648
TypeSmall organic molecule
Emp. Form.C24H36N8O2
Mol. Mass.468.595
SMILESCCCCNc1ncc(C(=O)NC2CCN(CC2)c2ncccn2)c(N[C@H]2CC[C@H](O)CC2)n1