Reaction Details
TargetTyrosine-protein kinase Mer
LigandBDBM50444242
Substrate/Competitorn/a
Meas. Tech.ChEMBL_1277932 (CHEMBL3094776)
IC50 5.2±n/a nM
Citation Zhang, WMcIver, ALStashko, MADeRyckere, DBranchford, BRHunter, DKireev, DMiley, MJNorris-Drouin, JStewart, WMLee, MSather, SZhou, YDi Paola, JAMachius, MJanzen, WPEarp, HSGraham, DKFrye, SVWang, X Discovery of Mer specific tyrosine kinase inhibitors for the treatment and prevention of thrombosis. J Med Chem56:9693-700 (2014) 
 
Tyrosine-protein kinase Mer
Name:Tyrosine-protein kinase Mer
Type:PROTEIN
Mol. Mass.:110234.77
Organism:Homo sapiens (Human)
Description:ChEMBL_1498723
Residue:999
BDBM50444242
NameBDBM50444242
Synonyms:CHEMBL3093755
TypeSmall organic molecule
Emp. Form.C22H32N6O4S
Mol. Mass.476.592
SMILESCCCCNc1ncc(C(=O)NCc2ccc(cc2)S(N)(=O)=O)c(N[C@H]2CC[C@H](O)CC2)n1