Reaction Details
TargetKallikrein-1
LigandBDBM50444297
Substrate/Competitorn/a
Meas. Tech.ChEMBL_1278120 (CHEMBL3095808)
IC50>50000±n/a nM
Citation Lucas, SDGonçalves, LMCarvalho, LACorreia, HFDa Costa, EMGuedes, RAMoreira, RGuedes, RC Optimization of O3-acyl kojic acid derivatives as potent and selective human neutrophil elastase inhibitors. J Med Chem56:9802-6 (2014) 
 
Kallikrein-1
Name:Kallikrein-1
Type:Enzyme
Mol. Mass.:28874.69
Organism:Homo sapiens (Human)
Description:P06870
Residue:262
BDBM50444297
NameBDBM50444297
Synonyms:CHEMBL3093815
TypeSmall organic molecule
Emp. Form.C18H17NO4S2
Mol. Mass.375.462
SMILESCC(C)(C)C(=O)Oc1coc(CSc2nc3ccccc3s2)cc1=O