Reaction Details
TargetMyeloblastin
LigandBDBM50084637
Substrate/Competitorn/a
Meas. Tech.ChEMBL_1278123 (CHEMBL3095811)
IC50>100000±n/a nM
Citation Lucas, SDGonçalves, LMCarvalho, LACorreia, HFDa Costa, EMGuedes, RAMoreira, RGuedes, RC Optimization of O3-acyl kojic acid derivatives as potent and selective human neutrophil elastase inhibitors. J Med Chem56:9802-6 (2014) 
 
Myeloblastin
Name:Myeloblastin
Type:PROTEIN
Mol. Mass.:27816.30
Organism:Homo sapiens (Human)
Description:ChEMBL_1463425
Residue:256
BDBM50084637
NameBDBM50084637
Synonyms:2,2-Dimethyl-propionic acid 4-[2-(carboxymethyl-carbamoyl)-phenylsulfamoyl]-phenyl ester CHEMBL76688 Sivelestat
TypeSmall organic molecule
Emp. Form.C20H22N2O7S
Mol. Mass.434.463
SMILESCC(C)(C)C(=O)Oc1ccc(cc1)S(=O)(=O)Nc1ccccc1C(=O)NCC(O)=O