Reaction Details
TargetDual specificity tyrosine-phosphorylation-regulated kinase 1A
LigandBDBM50444370
Substrate/Competitorn/a
Meas. Tech.ChEMBL_1279586 (CHEMBL3097668)
IC50 797±n/a nM
Citation Anderson, KChen, YChen, ZDominique, RGlenn, KHe, YJanson, CLuk, KCLukacs, CPolonskaia, AQiao, QRailkar, ARossman, PSun, HXiang, QVilenchik, MWovkulich, PZhang, X Pyrido[2,3-d]pyrimidines: discovery and preliminary SAR of a novel series of DYRK1B and DYRK1A inhibitors. Bioorg Med Chem Lett23:6610-5 (2013) 
 
Dual specificity tyrosine-phosphorylation-regulated kinase 1A
Name:Dual specificity tyrosine-phosphorylation-regulated kinase 1A
Type:Enzyme
Mol. Mass.:85616.61
Organism:Homo sapiens (Human)
Description:Q13627
Residue:763
BDBM50444370
NameBDBM50444370
Synonyms:CHEMBL3094457
TypeSmall organic molecule
Emp. Form.C27H27ClN6O4
Mol. Mass.534.994
SMILESCOc1ncc2cc(C(=O)Nc3cc(ccc3Cl)C(=O)NC(CCCCN)c3ccccc3)c(=O)[nH]c2n1