Reaction Details
TargetHexokinase-4
LigandBDBM50444410
Substrate/Competitorn/a
Meas. Tech.ChEMBL_1279808 (CHEMBL3095509)
EC50 26000±n/a nM
Citation Stevens, BDLitchfield, JPfefferkorn, JAAtkinson, KPerreault, CAmor, PBahnck, KBerliner, MACalloway, JCarlo, ADerksen, DRFilipski, KJGumkowski, MJassal, CMacDougall, MMurphy, BNkansah, PPettersen, JRotter, CZhang, Y Discovery of an intravenous hepatoselective glucokinase activator for the treatment of inpatient hyperglycemia. Bioorg Med Chem Lett23:6588-92 (2013) 
 
Hexokinase-4
Name:Hexokinase-4
Type:PROTEIN
Mol. Mass.:52101.81
Organism:Rattus norvegicus
Description:ChEMBL_1279785
Residue:465
BDBM50444410
NameBDBM50444410
Synonyms:CHEMBL3091580
TypeSmall organic molecule
Emp. Form.C20H24N4O5S
Mol. Mass.432.493
SMILESOC(=O)c1ccc(NC(=O)[C@H](CC2CCCC2)n2cnc(c2)S(=O)(=O)C2CC2)nc1